{"text_format":"1","workbook":"xlsx","n_sheets":9,"sheets":["Rating","Encoding","PART 1 - Proficient","ref","database","PART 1 - Highly Proficient","PART 2","PART 3","PART 4"],"not_rendered":{"charts":0,"images":0,"macros":1,"external_links":1,"defined_names":56,"comments":0,"pivot_tables":0},"unopened":[],"bounds":{"document_bytes":16777216,"sheet_cells":100000,"rows_first":2000,"rows_last":500,"rows_between":2000,"halvings":0,"cell_chars":16384,"cell_head_chars":4096},"cells_cut":0,"cells_raw":0,"read":"whole","date_system":"1900"}

{"sheet":"Rating","index":0,"n_rows":24,"n_cols":18,"rows_kept":24,"cut":false,"hidden":true,"merged":[]}
["Position","Proficiency Level",null,"Position_Objective","Type","Difference",null,"Prof","hiProf","Zero","Two","Three",null,"Prof22","hiProf22",null,"Prof23","hiProf23"]
["Teacher I","Prof",null,"ProfObjective 7A","Zero",0,null,7,8,5,7,8,null,"Objective 7A","Objective 7",null,"Objective 8A","Objective 8"]
["Teacher II","Prof",null,"ProfObjective 8A","Zero",0,null,6,7,4,6,7,null,"Objective 7B",null,null,"Objective 8B"]
["Teacher III","Prof",null,"ProfObjective 9A","Two",2,null,5,6,3,5,6]
["SPET I","Prof",null,"ProfObjective 10A","Two",2,null,4,5,2,4,5]
["SPET II","Prof",null,"ProfObjective 7B","Two",2,null,3,4,1,3,4]
["SPET III","Prof",null,"ProfObjective 8B","Two",2]
["SPET IV","Prof",null,"ProfObjective 9B","Zero",0]
["SPET V","hiProf",null,"ProfObjective 10B","Zero",0]
["Master Teacher I","hiProf",null,"hiProfObjective 7","Zero",0]
{"$rows_left_out":15}
{"sheet":"Encoding","index":1,"n_rows":112,"n_cols":24,"rows_kept":112,"cut":false,"hidden":false,"merged":[[27,1,32,1],[27,2,32,2],[62,3,62,10],[62,13,62,20],[63,3,63,10],[63,13,63,20],[64,3,64,10],[64,13,64,20],[59,2,59,10],[59,12,59,20],[60,3,60,10],[60,13,60,20],[61,3,61,10],[61,13,61,20],[55,3,55,10],[55,13,55,20],[56,3,56,10],[56,13,56,20],[57,3,57,10],[57,13,57,20],[52,2,52,10],[52,12,52,20],[53,3,53,10],[53,13,53,20],[54,3,54,10],[54,13,54,20],[48,3,48,10],[48,13,48,20],[49,3,49,10],[49,13,49,20],[50,3,50,10],[50,13,50,20],[44,2,44,20],[45,2,45,10],[45,12,45,20],[46,3,46,10],[46,13,46,20],[47,3,47,10],[47,13,47,20],[39,0,39,3],[39,4,39,8],[39,9,39,12],[40,0,40,3],[40,4,40,8],[40,9,40,12],[34,19,34,20],[35,1,35,5],[35,6,35,7],[35,8,35,9],[35,10,35,11],[35,12,35,13],[35,14,35,18],[35,19,35,20],[34,1,34,5],[34,6,34,7],[34,8,34,9],[34,10,34,11],[34,12,34,13],[34,14,34,18],[19,1,22,1],[19,2,22,2],[23,1,26,1],[23,2,26,2],[12,20,14,20],[13,6,13,7],[13,8,13,9],[13,10,13,11],[13,12,13,13],[15,1,18,1],[15,2,18,2],[12,8,12,9],[12,10,12,11],[12,12,12,13],[12,14,14,14],[12,15,13,18],[12,19,14,19],[12,1,14,1],[12,2,14,2],[12,3,14,3],[12,4,14,4],[12,5,14,5],[12,6,12,7],[10,17,10,20],[11,1,11,2],[11,3,11,6],[11,7,11,9],[11,10,11,13],[11,14,11,16],[11,17,11,20],[9,1,9,2],[9,3,9,6],[9,7,10,9],[9,10,9,13],[9,14,9,16],[9,17,9,20],[10,1,10,2],[10,3,10,6],[10,10,10,13],[10,14,10,16],[8,1,8,2],[8,3,8,6],[8,7,8,9],[8,10,8,13],[8,14,8,16],[8,17,8,20],[7,1,7,2],[7,3,7,6],[7,7,7,9],[7,10,7,13],[7,14,7,16],[7,17,7,20],[6,1,6,2],[6,3,6,6],[6,7,6,8],[6,9,6,13],[6,14,6,16],[6,17,6,20],[5,1,5,2],[5,3,5,6],[5,7,5,8],[5,9,5,13],[5,14,5,16],[5,17,5,20],[4,1,4,2],[4,3,4,6],[4,7,4,8],[4,9,4,13],[4,14,4,16],[4,17,4,20],[0,0,0,20],[1,0,1,20],[2,0,2,20],[3,1,3,2],[3,3,3,6],[3,7,3,8],[3,9,3,13],[3,14,3,16],[3,17,3,20]]}
["IPCRF Rating Encoding Form"]
[{"$f":"IF($X$4=\"P\",\"Teacher I-III (Proficient Teacher)\",\"Master Teacher I-IV (Highly Proficient Teacher)\")","v":"Teacher I-III (Proficient Teacher)"}]
["PART 1: INDIVIDUAL PERFORMANCE COMMITMENT AND REVIEW FORM"]
[null,"Name of Employee:",null,null,null,null,null,"Rater:",null,null,null,null,null,null,"Region:",null,null,null,null,null,null,null,null,{"$f":"IF(VLOOKUP($D$5,Rating!$A$1:$B$24,2,0)=\"hiProf\",\"HP\",\"P\")","v":"P"}]
[null,"Position:",null,"Teacher II",null,null,null,"Position:",null,null,null,null,null,null,"Division:"]
[null,"Employee ID #:",null,null,null,null,null,"Date of Review:",null,null,null,null,null,null,"District/Municipality:"]
[null,"Employment Status:",null,null,null,null,null,"Rating Period:",null,"SY 2021-2022",null,null,null,null,"School ID:"]
[null,"Age:",null,null,null,null,null,null,null,null,null,null,null,null,"School Name:"]
[null,"Sex:",null,null,null,null,null,"Number of Years in Teaching:",null,null,null,null,null,null,"School Type:"]
[null,"Level Taught:",null,null,null,null,null,"Highest Degree Obtained:",null,null,null,null,null,null,"School Size:"]
{"$rows_left_out":103}
{"sheet":"PART 1 - Proficient","index":2,"n_rows":40,"n_cols":17,"rows_kept":40,"cut":false,"hidden":false,"merged":[[0,0,0,16],[1,0,1,2],[1,3,1,7],[1,8,1,9],[1,10,1,16],[2,0,2,2],[2,3,2,7],[2,8,2,9],[2,10,2,16],[7,0,7,10],[7,11,7,16],[3,0,3,2],[3,3,3,7],[3,8,3,9],[3,10,3,16],[4,0,4,2],[4,3,4,7],[4,8,4,16],[8,0,10,0],[8,1,10,1],[8,2,10,2],[8,3,10,3],[8,4,10,4],[8,5,8,10],[8,11,10,11],[8,12,9,14],[8,15,10,15],[8,16,10,16],[9,5,10,5],[30,16,31,16],[33,0,33,3],[36,5,36,7],[36,8,36,10],[36,11,36,16],[30,10,31,11],[30,12,31,15],[11,0,29,0],[11,1,14,1],[37,0,37,1],[37,2,37,3],[37,5,37,7],[19,1,22,1],[15,1,18,1],[23,1,28,1],[37,8,37,10],[37,11,37,16],[34,0,34,1],[34,2,34,3],[35,0,35,1],[35,2,35,3],[36,0,36,1],[36,2,36,3],[38,0,38,1],[38,2,38,3],[38,5,38,7],[38,8,38,10],[38,11,38,16],[39,0,39,1],[39,2,39,3],[39,5,39,7],[39,8,39,10],[39,11,39,16]]}
["INDIVIDUAL PERFORMANCE COMMITMENT AND REVIEW FORM (IPCRF) for Teacher I-III"]
["Name of Employee:",null,null,{"$f":"IF(Encoding!D4=\"\",\"\",Encoding!D4)","v":""},null,null,null,null,"Name of Rater:",null,{"$f":"IF(Encoding!J4=\"\",\"\",Encoding!J4)","v":""}]
["Position:",null,null,{"$f":"IF(Encoding!D5=\"\",\"\",Encoding!D5)","v":"Teacher II"},null,null,null,null,"Position:",null,{"$f":"IF(Encoding!J5=\"\",\"\",Encoding!J5)","v":""}]
["Bureau/Center/Service/Division:",null,null,{"$f":"Encoding!R8&\" - \"&Encoding!R5","v":" - "},null,null,null,null,"Date of Review:",null,{"$f":"IF(Encoding!J6=\"\",\"\",Encoding!J6)","v":""}]
["Rating Period:",null,null,{"$f":"Encoding!J7","v":"SY 2021-2022"}]
[]
[]
["TO BE FILLED OUT DURING PLANNING",null,null,null,null,null,null,null,null,null,null,"TO BE FILLED OUT DURING EVALUATION"]
["MFOs","KRAs","Objectives","Timeline","Weight","Performance Indicators",null,null,null,null,null,"Actual Results","Rating",null,null,"Ave","Score"]
[null,null,null,null,null,"QET","Outstanding","Very Satisfactory","Satisfactory","Unsatisfactory","Poor"]
{"$rows_left_out":31}
{"sheet":"ref","index":3,"n_rows":26,"n_cols":20,"rows_kept":26,"cut":false,"hidden":true,"merged":[]}
["Category"]
["Pedagogy",null,null,null,null,null,null,{"$f":"Encoding!D5","v":"Teacher II"}]
["Constructivist Teaching",null,null,null,null,null,null,{"$f":"LEFT(H2,FIND(\" \",H2)-1)","v":"Teacher"},null,null,null,null,null,null,null,null,"Content_Knowledge_and_Pedagogy__PPST_Domain_1_P","Learning_Environment__PPST_Domain_2_P","Diversity_of_Learners_Curriculum_and_Planning_Assessment_and_Reporting__PPST_Domains_3_4_5_P","Community_Linkages_and_Professional_Engagement_Personal_Growth_and_Professional_Development__PPST_Domains_6_7_P"]
["Inquiry based",null,null,null,null,null,null,{"$f":"IF(OR(H3=\"Teacher\",H3=\"SPET\",H3=\"Special\"),Pro,HP)","v":"Content_Knowledge_and_Pedagogy__PPST_Domain_1_P"},"Learning_Environment__PPST_Domain_2_P","Diversity_of_Learners_Curriculum_and_Planning_Assessment_and_Reporting__PPST_Domains_3_4_5_P","Community_Linkages_and_Professional_Engagement_Personal_Growth_and_Professional_Development__PPST_Domains_6_7_P",null,null,null,null,null,"1.1 Applied knowledge of content within and across curriculum teaching areas. (PPST Indicator 1.1.2)","2.1 Established safe and secure learning environments to enhance learning through the consistent implementation of policies, guidelines and procedures. (PPST Indicator 2.1.2)","3.1 Designed, adapted and implemented teaching strategies that are responsive to learners with disabilities, giftedness and talents. (PPST Indicator 3.3.2)","4.1 Maintained learning environments that are responsive to community contexts. (PPST Indicator 6.1.2)"]
["Reflective Teaching",null,null,null,null,null,null,null,null,null,null,null,null,null,null,null,"1.2 Used research-based knowledge and principles of teaching and learning to enhance professional practice. (PPST Indicator 1.2.2)","2.2 Maintained learning environments that promote fairness, respect and care to encourage learning. (PPST Indicator 2.2.2)","3.2 Adapted and used culturally appropriate teaching strategies to address the needs of learners from indigenous groups. (PPS Indicator 3.5.2)","4.2 Reviewed regularly personal teaching practice using existing laws and regulations that apply to the teaching profession and the responsibilities specified in the Code of Ethics for Professional Teachers. (PPST Indicator 6.3.2)"]
["Collaborative Teaching",null,null,null,null,null,null,null,null,null,null,null,null,null,null,null,"1.3 Displayed proficient use of Mother Tongue, Filipino and English to facilitate teaching and learning. (PPST Indicator 1.6.2)","2.3 Maintained supportive learning environment that nurture and inspire learners to participate, cooperate and collaborate in continued learning. (PPST Indicator 2.4.2)","3.3 Adapted and implemented learning programs that ensure relevance and responsiveness to the needs of all learners. (PPST Indicator 4.3.2)","4.3 Complied with and implemented school policies and procedures consistently to foster harmonious relationships with learners, parents, and other stakeholders. (PPST Indicator 6.4.2)"]
["Integrated Approach",null,null,null,null,null,null,null,null,null,null,null,null,null,null,null,"1.4 Used effective verbal and non-verbal classroom communication strategies to support learner understanding, participation, engagement and achievement. (PPST Indicator 1.7.2)","2.4 Applied a range of successful strategies that maintain learning environments that motivate learners to work productively by assuming responsibility for their own learning. (PPST Indicator 2.5.2)","3.4 Utilized assessment data to inform the modification of teaching and learning practices and programs. (PPST Indicator 5.5.2)","4.4 Apply a personal philosophy of teaching that is learner-centered. (PPST Indicator 7.1.2)"]
["Inclusive Education",null,null,null,null,null,null,null,null,null,null,null,null,null,null,null,null,null,null,"4.5 Adopt practices that uphold the dignity of teaching as a profession by exhibiting qualities such as caring attitude, respect & integrity. (PPST Indicator 7.2.2)"]
[null,null,null,null,null,null,null,null,null,null,null,null,null,null,null,null,null,null,null,"4.6 Set professional development goals based on the Philippine Professional Standard for Teachers. (PPST Indicator 7.5.2)"]
["Effective Communication (Oral and Writing Skills)",null,null,null,null,null,null,null,null,null,null,null,null,null,null,null,"Content_Knowledge_and_Pedagogy__PPST_Domain_1_HP","Learning_Environment__PPST_Domain_2_HP","Diversity_of_Learners_Curriculum_and_Planning_Assessment_and_Reporting__PPST_Domains_3_4_5_HP","Community_Linkages_and_Professional_Engagement_Personal_Growth_and_Professional_Development__PPST_Domains_6_7_HP"]
{"$rows_left_out":17}
{"sheet":"database","index":4,"n_rows":2,"n_cols":216,"rows_kept":2,"cut":false,"hidden":true,"merged":[]}
["NAME","POS","EMPNO","EMPSTATUS","AGE","SEX","LEVEL_TAUGHT","GRADE_TAUGHT","SUBJECT_TAUGHT","YEARSNO","DEGREE","HDEGREE","SPECIALIZATION","RATER","R_POS","DATE_REVIEW","PERIOD","REGION","DIVISION","DISTRICT","SCHOOID","SCHOOL","SCHOOL_TYPE","SCHOOL_SIZE","CLASSIFICATION","COT1_SUBJECT","COT1_DATE","COT1_1","COT1_2","COT1_3","COT1_4","COT1_5","COT1_6","COT1_7","COT1_8","COT1_9","COT1_10","COT1_11","COT1_12","COT1_13","COT1_14","COT1_15","COT1_16","COT1_17","COT2_SUBJECT","COT2_DATE","COT2_1","COT2_2","COT2_3","COT2_4","COT2_5","COT2_6","COT2_7","COT2_8","COT2_9","COT2_10","COT2_11","COT2_12","COT2_13","COT2_14","COT2_15","COT2_16","COT2_17","AVE_1","AVE_2","AVE_3","AVE_4","AVE_5","AVE_6","AVE_7","AVE_8","AVE_9","AVE_10","AVE_11","AVE_12","AVE_13","AVE_14","AVE_15","AVE_16","AVE_17","Q_1","Q_2","Q_3","Q_4","Q_5","Q_6","Q_7","Q_8","Q_9","Q_10","Q_11","Q_12","Q_13","Q_14","Q_15","Q_16","Q_17","Q_18","Q_19","AVE_R_1","AVE_R_2","AVE_R_3","AVE_R_4","AVE_R_5","AVE_R_6","AVE_R_7","AVE_R_8","AVE_R_9","AVE_R_10","AVE_R_11","AVE_R_12","AVE_R_13","AVE_R_14","AVE_R_15","AVE_R_16","AVE_R_17","AVE_R_18","AVE_R_19","SCORE_1","SCORE_2","SCORE_3","SCORE_4","SCORE_5","SCORE_6","SCORE_7","SCORE_8","SCORE_9","SCORE_10","SCORE_11","SCORE_12","SCORE_13","SCORE_14","SCORE_15","SCORE_16","SCORE_17","SCORE_18","SCORE_19","RATING_1","RATING_2","RATING_3","RATING_4","RATING_5","RATING_6","RATING_7","RATING_8","RATING_9","RATING_10","RATING_11","RATING_12","RATING_13","RATING_14","RATING_15","RATING_16","RATING_17","RATING_18","RATING_19","F_RATING","AD_RATING","APPROVING_AUTH","APPROVING_AUTH_POS","SELF","PROF","RESULT","TEAMWORK","SERVICE","INNOVATION","STR_CAT1","STR_1","STR_CAT2","STR_2","STR_CAT3","STR_3","DEV_CAT1","DEV_NEEDS1","DEV_CAT2","DEV_NEEDS2","DEV_CAT3","DEV_NEEDS3","LO_1","LO_2","LO_3","INT_1","INT_2","INT_3","TIMELINE_1","TIMELINE_2","TIMELINE_3","RESOURCE_1","RESOURCE_2","RESOURCE_3","STR_CAT1B","STR_1B","STR_CAT2B","STR_2B","STR_CAT3B","STR_3B","DEV_CAT1B","DEV_NEEDS1B","DEV_CAT2B","DEV_NEEDS2B","DEV_CAT3B","DEV_NEEDS3B","LO_1B","LO_2B","LO_3B","INT_1B","INT_2B","INT_3B","TIMELINE_1B","TIMELINE_2B","TIMELINE_3B","RESOURCE_1B","RESOURCE_2B","RESOURCE_3B","FEEDBACK","EMAIL"]
[{"$f":"Encoding!D4","v":0},{"$f":"Encoding!D5","v":"Teacher II"},{"$f":"Encoding!D6","v":0},{"$f":"Encoding!D7","v":0},{"$f":"Encoding!D8","v":0},{"$f":"Encoding!D9","v":0},{"$f":"Encoding!D10","v":0},{"$f":"Encoding!D11","v":0},{"$f":"Encoding!D12","v":0},{"$f":"Encoding!K9","v":0},{"$f":"Encoding!K10","v":0},{"$f":"Encoding!K11","v":0},{"$f":"Encoding!K12","v":0},{"$f":"Encoding!J4","v":0},{"$f":"Encoding!J5","v":0},{"$f":"Encoding!J6","v":"00:00:00"},{"$f":"Encoding!J7","v":"SY 2021-2022"},{"$f":"Encoding!R4","v":0},{"$f":"Encoding!R5","v":0},{"$f":"Encoding!R6","v":"00:00:00"},{"$f":"Encoding!R7","v":0},{"$f":"Encoding!R8","v":"00:00:00"},{"$f":"Encoding!R9","v":0},{"$f":"Encoding!R10","v":0},{"$f":"Encoding!R11","v":0},{"$f":"Encoding!G14","v":0},{"$f":"Encoding!G35","v":"00:00:00"},{"$f":"Encoding!G16","v":0},{"$f":"Encoding!G17","v":0},{"$f":"Encoding!G18","v":0},{"$f":"Encoding!G19","v":0},{"$f":"Encoding!G20","v":0},{"$f":"Encoding!G21","v":0},{"$f":"Encoding!G22","v":0},{"$f":"Encoding!G23","v":0},{"$f":"Encoding!G24","v":0},{"$f":"Encoding!G25","v":0},{"$f":"Encoding!G26","v":0},{"$f":"Encoding!G27","v":0},{"$f":"Encoding!G28","v":0},{"$f":"Encoding!G29","v":0},{"$f":"Encoding!G30","v":0},{"$f":"Encoding!G31","v":0},{"$f":"Encoding!G32","v":0},{"$f":"Encoding!I14","v":0},{"$f":"Encoding!I35","v":"00:00:00"},{"$f":"Encoding!I16","v":0},{"$f":"Encoding!I17","v":0},{"$f":"Encoding!I18","v":0},{"$f":"Encoding!I19","v":0},{"$f":"Encoding!I20","v":0},{"$f":"Encoding!I21","v":0},{"$f":"Encoding!I22","v":0},{"$f":"Encoding!I23","v":0},{"$f":"Encoding!I24","v":0},{"$f":"Encoding!I25","v":0},{"$f":"Encoding!I26","v":0},{"$f":"Encoding!I27","v":0},{"$f":"Encoding!I28","v":0},{"$f":"Encoding!I29","v":0},{"$f":"Encoding!I30","v":0},{"$f":"Encoding!I31","v":0},{"$f":"Encoding!I32","v":0},{"$f":"Encoding!O16","v":0},{"$f":"Encoding!O17","v":0},{"$f":"Encoding!O18","v":0},{"$f":"Encoding!O19","v":0},{"$f":"Encoding!O20","v":0},{"$f":"Encoding!O21","v":0},{"$f":"Encoding!O22","v":0},{"$f":"Encoding!O23","v":0},{"$f":"Encoding!O24","v":0},{"$f":"Encoding!O25","v":0},{"$f":"Encoding!O26","v":0},{"$f":"Encoding!O27","v":0},{"$f":"Encoding!O28","v":0},{"$f":"Encoding!O29","v":0},{"$f":"Encoding!O30","v":0},{"$f":"Encoding!O31","v":0},{"$f":"Encoding!O32","v":0},{"$f":"Encoding!P16","v":1},{"$f":"Encoding!P17","v":0},{"$f":"Encoding!P18","v":1},{"$f":"Encoding!P19","v":1},{"$f":"Encoding!P20","v":1},{"$f":"Encoding!P21","v":1},{"$f":"Encoding!P22","v":1},{"$f":"Encoding!P23","v":1},{"$f":"Encoding!P24","v":1},{"$f":"Encoding!P25","v":1},{"$f":"Encoding!P26","v":0},{"$f":"Encoding!P27","v":0},{"$f":"Encoding!P28","v":0},{"$f":"Encoding!P29","v":0},{"$f":"Encoding!P30","v":0},{"$f":"Encoding!P31","v":0},{"$f":"Encoding!P32","v":0},{"$f":"Encoding!P33","v":0},{"$f":"Encoding!P34","v":0},{"$f":"Encoding!S16","v":1},{"$f":"Encoding!S17","v":0},{"$f":"Encoding!S18","v":1},{"$f":"Encoding!S19","v":1},{"$f":"Encoding!S20","v":1},{"$f":"Encoding!S21","v":1},{"$f":"Encoding!S22","v":1},{"$f":"Encoding!S23","v":1},{"$f":"Encoding!S24","v":1},{"$f":"Encoding!S25","v":1},{"$f":"Encoding!S26","v":0},{"$f":"Encoding!S27","v":0},{"$f":"Encoding!S28","v":0},{"$f":"Encoding!S29","v":0},{"$f":"Encoding!S30","v":0},{"$f":"Encoding!S31","v":0},{"$f":"Encoding!S32","v":0},{"$f":"Encoding!S33","v":0},{"$f":"Encoding!S34","v":0},{"$f":"Encoding!T16","v":0.05},{"$f":"Encoding!T17","v":0},{"$f":"Encoding!T18","v":0.05},{"$f":"Encoding!T19","v":0.05},{"$f":"Encoding!T20","v":0.05},{"$f":"Encoding!T21","v":0.05},{"$f":"Encoding!T22","v":0.05},{"$f":"Encoding!T23","v":0.05},{"$f":"Encoding!T24","v":0.05},{"$f":"Encoding!T25","v":0.05},{"$f":"Encoding!T26","v":0},{"$f":"Encoding!T27","v":0},{"$f":"Encoding!T28","v":0},{"$f":"Encoding!T29","v":0},{"$f":"Encoding!T30","v":0},{"$f":"Encoding!T31","v":0},{"$f":"Encoding!T32","v":0},{"$f":"Encoding!T33","v":0},{"$f":"Encoding!T34","v":0},{"$f":"Encoding!U16","v":"Poor"},{"$f":"Encoding!U17","v":"Poor"},{"$f":"Encoding!U18","v":"Poor"},{"$f":"Encoding!U19","v":"Poor"},{"$f":"Encoding!U20","v":"Poor"},{"$f":"Encoding!U21","v":"Poor"},{"$f":"Encoding!U22","v":"Poor"},{"$f":"Encoding!U23","v":"Poor"},{"$f":"Encoding!U24","v":"Poor"},{"$f":"Encoding!U25","v":"Poor"},{"$f":"Encoding!U26","v":"Poor"},{"$f":"Encoding!U27","v":"Poor"},{"$f":"Encoding!U28","v":"Poor"},{"$f":"Encoding!U29","v":"Poor"},{"$f":"Encoding!U30","v":"Poor"},{"$f":"Encoding!U31","v":"Poor"},{"$f":"Encoding!U32","v":"Poor"},{"$f":"Encoding!U33","v":"Poor"},{"$f":"Encoding!U34","v":"Poor"},{"$f":"Encoding!T35","v":0.44999999999999996},{"$f":"Encoding!T36","v":"Poor"},{"$f":"Encoding!J40","v":0},{"$f":"Encoding!J41","v":0},{"$f":"'PART 2'!B4","v":0},{"$f":"'PART 2'!B10","v":0},{"$f":"'PART 2'!B16","v":0},{"$f":"'PART 2'!D4","v":0},{"$f":"'PART 2'!D10","v":0},{"$f":"'PART 2'!D16","v":0},{"$f":"'PART 4'!B8","v":0},{"$f":"'PART 4'!C8","v":0},{"$f":"'PART 4'!B9","v":0},{"$f":"'PART 4'!C9","v":0},{"$f":"'PART 4'!B10","v":0},{"$f":"'PART 4'!C10","v":0},{"$f":"'PART 4'!D8","v":0},{"$f":"'PART 4'!E8","v":0},{"$f":"'PART 4'!D9","v":0},{"$f":"'PART 4'!E9","v":0},{"$f":"'PART 4'!D10","v":0},{"$f":"'PART 4'!E10","v":0},{"$f":"'PART 4'!F8","v":0},{"$f":"'PART 4'!F9","v":0},{"$f":"'PART 4'!F10","v":0},{"$f":"'PART 4'!G8","v":0},{"$f":"'PART 4'!G9","v":0},{"$f":"'PART 4'!G10","v":0},{"$f":"'PART 4'!H8","v":0},{"$f":"'PART 4'!H9","v":0},{"$f":"'PART 4'!H10","v":0},{"$f":"'PART 4'!I8","v":0},{"$f":"'PART 4'!I9","v":0},{"$f":"'PART 4'!I10","v":0},{"$f":"'PART 4'!B13","v":"Results_Focus"},{"$f":"'PART 4'!C13","v":0},{"$f":"'PART 4'!B14","v":0},{"$f":"'PART 4'!C14","v":0},{"$f":"'PART 4'!B15","v":0},{"$f":"'PART 4'!C15","v":0},{"$f":"'PART 4'!D13","v":0},{"$f":"'PART 4'!E13","v":0},{"$f":"'PART 4'!D14","v":0},{"$f":"'PART 4'!E14","v":0},{"$f":"'PART 4'!D15","v":0},{"$f":"'PART 4'!E15","v":0},{"$f":"'PART 4'!F13","v":0},{"$f":"'PART 4'!F14","v":0},{"$f":"'PART 4'!F15","v":0},{"$f":"'PART 4'!G13","v":0},{"$f":"'PART 4'!G14","v":0},{"$f":"'PART 4'!G15","v":0},{"$f":"'PART 4'!H13","v":0},{"$f":"'PART 4'!H14","v":0},{"$f":"'PART 4'!H15","v":0},{"$f":"'PART 4'!I13","v":0},{"$f":"'PART 4'!I14","v":0},{"$f":"'PART 4'!I15","v":0},{"$f":"'PART 4'!B17","v":0},{"$f":"'PART 4'!D26","v":0}]

{"sheet":"PART 1 - Highly Proficient","index":5,"n_rows":40,"n_cols":17,"rows_kept":40,"cut":false,"hidden":true,"merged":[[3,0,3,2],[4,0,4,2],[0,0,0,16],[1,0,1,2],[2,0,2,2],[1,3,1,7],[1,10,1,16],[2,10,2,16],[3,10,3,16],[4,8,4,16],[2,3,2,7],[3,3,3,7],[4,3,4,7],[1,8,1,9],[2,8,2,9],[3,8,3,9],[11,0,29,0],[11,1,14,1],[15,1,18,1],[19,1,22,1],[23,1,28,1],[7,0,7,10],[7,11,7,16],[8,0,10,0],[8,1,10,1],[8,2,10,2],[8,3,10,3],[8,4,10,4],[8,5,8,10],[8,12,9,14],[8,15,10,15],[8,16,10,16],[9,5,10,5],[8,11,10,11],[30,10,31,11],[30,12,31,15],[30,16,31,16],[33,0,33,3],[36,5,36,7],[36,8,36,10],[36,11,36,16],[34,0,34,1],[34,2,34,3],[35,0,35,1],[35,2,35,3],[36,0,36,1],[36,2,36,3],[37,0,37,1],[37,2,37,3],[37,5,37,7],[37,8,37,10],[37,11,37,16],[38,0,38,1],[38,2,38,3],[38,5,38,7],[38,8,38,10],[38,11,38,16],[39,0,39,1],[39,2,39,3],[39,5,39,7],[39,8,39,10],[39,11,39,16]]}
["INDIVIDUAL PERFORMANCE COMMITMENT AND REVIEW FORM (IPCRF) for Master Teacher I-IV"]
["Name of Employee:",null,null,{"$f":"IF(Encoding!D4=\"\",\"\",Encoding!D4)","v":""},null,null,null,null,"Name of Rater:",null,{"$f":"IF(Encoding!J4=\"\",\"\",Encoding!J4)","v":""}]
["Position:",null,null,{"$f":"IF(Encoding!D5=\"\",\"\",Encoding!D5)","v":"Teacher II"},null,null,null,null,"Position:",null,{"$f":"IF(Encoding!J5=\"\",\"\",Encoding!J5)","v":""}]
["Bureau/Center/Service/Division:",null,null,{"$f":"Encoding!R8&\" - \"&Encoding!R5","v":" - "},null,null,null,null,"Date of Review:",null,{"$f":"IF(Encoding!J6=\"\",\"\",Encoding!J6)","v":""}]
["Rating Period:",null,null,{"$f":"Encoding!J7","v":"SY 2021-2022"}]
[]
[]
["TO BE FILLED OUT DURING PLANNING",null,null,null,null,null,null,null,null,null,null,"TO BE FILLED OUT DURING EVALUATION"]
["MFOs","KRAs","Objectives","Timeline","Weight","Performance Indicators",null,null,null,null,null,"Actual Results","Rating",null,null,"Ave","Score"]
[null,null,null,null,null,"QET","Outstanding","Very Satisfactory","Satisfactory","Unsatisfactory","Poor"]
{"$rows_left_out":31}
{"sheet":"PART 2","index":6,"n_rows":22,"n_cols":4,"rows_kept":22,"cut":false,"hidden":false,"merged":[[15,1,20,1],[15,3,20,3],[21,0,21,3],[0,0,0,3],[1,0,1,3],[2,0,2,3],[3,1,8,1],[3,3,8,3],[9,1,14,1],[9,3,14,3]]}
["PART II: COMPETENCIES"]
["Instructions: Please indicate the number of competency indicators that you demonstrated during the performance cycle. "]
["CORE BEHAVIORAL COMPETENCIES"]
["Self-Management",{"$f":"COUNTIF(Encoding!C68:C72,TRUE)","v":0},"Teamwork",{"$f":"COUNTIF(Encoding!C83:C87,TRUE)","v":0}]
["1. Sets personal goals and directions, needs and development.",null,"1. Willingly does his/her share of responsibility."]
["2. Undertakes personal actions and behavior that are clear and purposive and takes into account personal goals and values congruent to that of the organization.",null,"2. Promotes collaboration and removes barrier to teamwork and goal accomplishment across the organization."]
["3. Displays emotional maturity and enthusiasm for and is challenged by higher goals.",null,"3. Applies negotiation principles in arriving at win-win agreements."]
["4. Prioritizes work tasks and schedules (through Gantt chants, checklists, etc.) to achieve goals.",null,"4. Drives consensus and team ownership of decisions."]
["5. Sets high quality, challenging, realistic goals for self and others.",null,"5. Works constructively and collaboratively with others and across organizations to accomplish organization goals and objectives."]
["Professionalism and Ethics",{"$f":"COUNTIF(Encoding!C73:C77,TRUE)","v":0},"Service Orientation",{"$f":"COUNTIF(Encoding!C88:C92,TRUE)","v":0}]
{"$rows_left_out":13}
{"sheet":"PART 3","index":7,"n_rows":37,"n_cols":11,"rows_kept":37,"cut":false,"hidden":false,"merged":[[35,0,35,2],[35,3,35,7],[35,8,35,11],[36,0,36,2],[36,3,36,7],[36,8,36,11],[30,9,30,10],[31,7,31,8],[31,9,31,10],[9,10,10,10],[11,1,14,1],[11,2,14,2],[15,1,18,1],[15,2,18,2],[19,1,22,1],[19,2,22,2],[23,1,28,1],[23,2,28,2],[30,1,31,2],[30,3,31,6],[30,7,30,8],[6,1,6,2],[6,3,6,5],[6,6,6,10],[8,1,8,10],[9,1,10,1],[9,2,10,2],[9,3,10,3],[9,4,10,4],[9,5,9,8],[9,9,10,9],[4,1,4,2],[4,3,4,5],[4,6,4,7],[4,8,4,10],[5,1,5,2],[5,3,5,5],[5,6,5,7],[5,8,5,10],[0,0,0,11],[1,0,1,11],[3,1,3,2],[3,3,3,5],[3,6,3,7],[3,8,3,10]]}
["INDIVIDUAL PERFORMANCE COMMITMENT AND REVIEW FORM (IPCRF) SUMMARY SHEET"]
[{"$f":"IF(ISERROR(SEARCH(\"Master\",Encoding!D5)),\"Teacher I-III (Proficient Teacher)\",\"Master Teacher I-IV (Highly Proficient Teacher)\")","v":"Teacher I-III (Proficient Teacher)"}]
[]
[null,"Name of Employee:",null,{"$f":"IF(Encoding!D4=\"\", \"\",Encoding!D4)","v":""},null,null,"Name of Rater:",null,{"$f":"IF(Encoding!J4=\"\",\"\",Encoding!J4)","v":""}]
[null,"Position:",null,{"$f":"IF(Encoding!D5=\"\",\"\",Encoding!D5)","v":"Teacher II"},null,null,"Position:",null,{"$f":"IF(Encoding!J5=\"\",\"\",Encoding!J5)","v":""}]
[null,"Bureau/Center/Service/Division:",null,{"$f":"Encoding!R8&\" - \"&Encoding!R5","v":" - "},null,null,"Date of Review:",null,{"$f":"IF(Encoding!J6=\"\",\"\",Encoding!J6)","v":""}]
[null,"Rating Period:",null,{"$f":"IF(Encoding!J7=\"\",\"\",Encoding!J7)","v":"SY 2021-2022"}]
[]
[null,"PART III. SUMMARY OF RATINGS FOR DISCUSSION"]
[null,"KRA","Weight per KRA","Objectives","Weight per Objective","Numerical Ratings",null,null,null,"Score","Adjectival\nRating"]
{"$rows_left_out":28}
{"sheet":"PART 4","index":8,"n_rows":26,"n_cols":9,"rows_kept":26,"cut":false,"hidden":false,"merged":[[25,1,25,2],[25,3,25,4],[21,1,21,4],[21,5,21,6],[21,7,21,8],[22,1,22,4],[22,5,22,6],[22,7,22,8],[5,1,5,8],[10,1,10,8],[15,1,15,8],[16,1,20,8],[2,1,4,1],[2,4,4,4],[0,1,0,8],[2,5,2,6],[2,7,4,7],[2,8,4,8],[3,5,3,6]]}
[null,"PART IV: DEVELOPMENT PLANS"]
[]
[null,"Strengths",null,null,"Development Needs","Action Plan",null,"Timeline","Resources Needed"]
[null,null,null,null,null,"(Recommended Developmental Intervention)"]
[null,null,null,null,null,"Learning Objectives","Intervention"]
[null,"A. Functional Competencies (RPMS-PPST Objectives from Part II of e-SAT)"]
[null,"Objective",null,"Objective"]
[]
[]
[]
{"$rows_left_out":16}